Reaction Details
TargetcAMP-specific 3',5'-cyclic phosphodiesterase 7B
LigandBDBM50180268
Substrate/Competitorn/a
Meas. Tech.ChEMBL_1583587 (CHEMBL3815674)
IC50>10000±n/a nM
Citation Yoshikawa, MHitaka, THasui, TFushimi, MKunitomo, JKokubo, HOki, HNakashima, KTaniguchi, T Design and synthesis of potent and selective pyridazin-4(1H)-one-based PDE10A inhibitors interacting with Tyr683 in the PDE10A selectivity pocket. Bioorg Med Chem24:3447-55 (2016) 
 
cAMP-specific 3',5'-cyclic phosphodiesterase 7B
Name:cAMP-specific 3',5'-cyclic phosphodiesterase 7B
Type:Enzyme
Mol. Mass.:51842.76
Organism:Homo sapiens (Human)
Description:Q9NP56
Residue:450
BDBM50180268
NameBDBM50180268
Synonyms:CHEMBL3814662
TypeSmall organic molecule
Emp. Form.C28H27N7O2
Mol. Mass.493.5597
SMILESO=c1c(OCCN2CCn3c2nc2ccccc32)cn(CC2CC2)nc1-c1ccnn1-c1ccccc1