Reaction Details
TargetcAMP and cAMP-inhibited cGMP 3',5'-cyclic phosphodiesterase 10A
LigandBDBM50180273
Substrate/Competitorn/a
Meas. Tech.ChEMBL_1583580 (CHEMBL3815667)
IC50 550±n/a nM
Citation Yoshikawa, MHitaka, THasui, TFushimi, MKunitomo, JKokubo, HOki, HNakashima, KTaniguchi, T Design and synthesis of potent and selective pyridazin-4(1H)-one-based PDE10A inhibitors interacting with Tyr683 in the PDE10A selectivity pocket. Bioorg Med Chem24:3447-55 (2016) 
 
cAMP and cAMP-inhibited cGMP 3',5'-cyclic phosphodiesterase 10A
Name:cAMP and cAMP-inhibited cGMP 3',5'-cyclic phosphodiesterase 10A
Type:Protein
Mol. Mass.:88412.52
Organism:Homo sapiens (Human)
Description:Q9Y233
Residue:1055
BDBM50180273
NameBDBM50180273
Synonyms:CHEMBL3815042
TypeSmall organic molecule
Emp. Form.C16H13F3N4O2
Mol. Mass.350.2952
SMILESCOc1cn(CC(F)(F)F)nc(-c2ccnn2-c2ccccc2)c1=O