Reaction Details
TargetcAMP and cAMP-inhibited cGMP 3',5'-cyclic phosphodiesterase 10A
LigandBDBM50180312
Substrate/Competitorn/a
Meas. Tech.ChEMBL_1583580 (CHEMBL3815667)
IC50 2400±n/a nM
Citation Yoshikawa, MHitaka, THasui, TFushimi, MKunitomo, JKokubo, HOki, HNakashima, KTaniguchi, T Design and synthesis of potent and selective pyridazin-4(1H)-one-based PDE10A inhibitors interacting with Tyr683 in the PDE10A selectivity pocket. Bioorg Med Chem24:3447-55 (2016) 
 
cAMP and cAMP-inhibited cGMP 3',5'-cyclic phosphodiesterase 10A
Name:cAMP and cAMP-inhibited cGMP 3',5'-cyclic phosphodiesterase 10A
Type:Protein
Mol. Mass.:88412.52
Organism:Homo sapiens (Human)
Description:Q9Y233
Residue:1055
BDBM50180312
NameBDBM50180312
Synonyms:CHEMBL3814288
TypeSmall organic molecule
Emp. Form.C15H14N4O2
Mol. Mass.282.2973
SMILESCOc1cn(nc(-c2ccnn2C)c1=O)-c1ccccc1