Reaction Details
TargetBromodomain-containing protein 4
LigandBDBM50183453
Substrate/Competitorn/a
Meas. Tech.ChEMBL_1586797 (CHEMBL3826482)
IC50>100000±n/a nM
Citation Martin, LJKoegl, MBader, GCockcroft, XLFedorov, OFiegen, DGerstberger, THofmann, MHHohmann, AFKessler, DKnapp, SKnesl, PKornigg, SMüller, SNar, HRogers, CRumpel, KSchaaf, OSteurer, STallant, CVakoc, CRZeeb, MZoephel, APearson, MBoehmelt, GMcConnell, D Structure-Based Design of an in Vivo Active Selective BRD9 Inhibitor. J Med Chem59:4462-75 (2016) 
 
Bromodomain-containing protein 4
Name:Bromodomain-containing protein 4
Type:Protein
Mol. Mass.:152264.84
Organism:Homo sapiens (Human)
Description:O60885
Residue:1362
BDBM50183453
NameBDBM50183453
Synonyms:CHEMBL3824312
TypeSmall organic molecule
Emp. Form.C19H22N4O3
Mol. Mass.354.403
SMILESCOc1cc(cc(OC)c1CN(C)C)-c1cn(C)c(=O)c2cncnc12