Reaction Details
TargetBromodomain-containing protein 4
LigandBDBM50183567
Substrate/Competitorn/a
Meas. Tech.ChEMBL_1586797 (CHEMBL3826482)
IC50 1147±n/a nM
Citation Martin, LJKoegl, MBader, GCockcroft, XLFedorov, OFiegen, DGerstberger, THofmann, MHHohmann, AFKessler, DKnapp, SKnesl, PKornigg, SMüller, SNar, HRogers, CRumpel, KSchaaf, OSteurer, STallant, CVakoc, CRZeeb, MZoephel, APearson, MBoehmelt, GMcConnell, D Structure-Based Design of an in Vivo Active Selective BRD9 Inhibitor. J Med Chem59:4462-75 (2016) 
 
Bromodomain-containing protein 4
Name:Bromodomain-containing protein 4
Type:Protein
Mol. Mass.:152264.84
Organism:Homo sapiens (Human)
Description:O60885
Residue:1362
BDBM50183567
NameBDBM50183567
Synonyms:CHEMBL3823177
TypeSmall organic molecule
Emp. Form.C19H25N3O3
Mol. Mass.343.4201
SMILESCOc1cc(cc(OC)c1CN1CC(N)C1)-c1cc(C)c(=O)n(C)c1