Reaction Details
TargetBromodomain-containing protein 4
LigandBDBM50183569
Substrate/Competitorn/a
Meas. Tech.ChEMBL_1586797 (CHEMBL3826482)
IC50 3778±n/a nM
Citation Martin, LJKoegl, MBader, GCockcroft, XLFedorov, OFiegen, DGerstberger, THofmann, MHHohmann, AFKessler, DKnapp, SKnesl, PKornigg, SMüller, SNar, HRogers, CRumpel, KSchaaf, OSteurer, STallant, CVakoc, CRZeeb, MZoephel, APearson, MBoehmelt, GMcConnell, D Structure-Based Design of an in Vivo Active Selective BRD9 Inhibitor. J Med Chem59:4462-75 (2016) 
 
Bromodomain-containing protein 4
Name:Bromodomain-containing protein 4
Type:Protein
Mol. Mass.:152264.84
Organism:Homo sapiens (Human)
Description:O60885
Residue:1362
BDBM50183569
NameBDBM50183569
Synonyms:CHEMBL3823906
TypeSmall organic molecule
Emp. Form.C18H24N2O3
Mol. Mass.316.3948
SMILESCOc1cc(c(OC)cc1CN(C)C)-c1cc(C)c(=O)n(C)c1