Reaction Details
TargetCytochrome P450 3A4
LigandBDBM50183448
Substrate/Competitorn/a
Meas. Tech.ChEMBL_1586835 (CHEMBL3826667)
IC50>50000±n/a nM
Citation Martin, LJKoegl, MBader, GCockcroft, XLFedorov, OFiegen, DGerstberger, THofmann, MHHohmann, AFKessler, DKnapp, SKnesl, PKornigg, SMüller, SNar, HRogers, CRumpel, KSchaaf, OSteurer, STallant, CVakoc, CRZeeb, MZoephel, APearson, MBoehmelt, GMcConnell, D Structure-Based Design of an in Vivo Active Selective BRD9 Inhibitor. J Med Chem59:4462-75 (2016) 
 
Cytochrome P450 3A4
Name:Cytochrome P450 3A4
Type:Enzyme
Mol. Mass.:57349.57
Organism:Homo sapiens (Human)
Description:n/a
Residue:503
BDBM50183448
NameBDBM50183448
Synonyms:CHEMBL3823478 | US11773085, Compound B2
TypeSmall organic molecule
Emp. Form.C20H23N3O3
Mol. Mass.353.4149
SMILESCOc1cc(cc(OC)c1CN(C)C)-c1cn(C)c(=O)c2cnccc12