Reaction Details
TargetBromodomain-containing protein 4
LigandBDBM50183571
Substrate/Competitorn/a
Meas. Tech.ChEMBL_1586797 (CHEMBL3826482)
IC50 32430±n/a nM
Citation Martin, LJKoegl, MBader, GCockcroft, XLFedorov, OFiegen, DGerstberger, THofmann, MHHohmann, AFKessler, DKnapp, SKnesl, PKornigg, SMüller, SNar, HRogers, CRumpel, KSchaaf, OSteurer, STallant, CVakoc, CRZeeb, MZoephel, APearson, MBoehmelt, GMcConnell, D Structure-Based Design of an in Vivo Active Selective BRD9 Inhibitor. J Med Chem59:4462-75 (2016) 
 
Bromodomain-containing protein 4
Name:Bromodomain-containing protein 4
Type:Protein
Mol. Mass.:152264.84
Organism:Homo sapiens (Human)
Description:O60885
Residue:1362
BDBM50183571
NameBDBM50183571
Synonyms:CHEMBL3822501
TypeSmall organic molecule
Emp. Form.C18H24N2O2
Mol. Mass.300.3954
SMILESCOc1cc(cc(C)c1CN(C)C)-c1cc(C)c(=O)n(C)c1