Reaction Details
TargetBromodomain-containing protein 9
LigandBDBM50183572
Substrate/Competitorn/a
Meas. Tech.ChEMBL_1586798 (CHEMBL3826483)
IC50 470±n/a nM
Citation Martin, LJKoegl, MBader, GCockcroft, XLFedorov, OFiegen, DGerstberger, THofmann, MHHohmann, AFKessler, DKnapp, SKnesl, PKornigg, SMüller, SNar, HRogers, CRumpel, KSchaaf, OSteurer, STallant, CVakoc, CRZeeb, MZoephel, APearson, MBoehmelt, GMcConnell, D Structure-Based Design of an in Vivo Active Selective BRD9 Inhibitor. J Med Chem59:4462-75 (2016) 
 
Bromodomain-containing protein 9
Name:Bromodomain-containing protein 9
Type:PROTEIN
Mol. Mass.:66994.30
Organism:Homo sapiens (Human)
Description:ChEMBL_108000
Residue:597
BDBM50183572
NameBDBM50183572
Synonyms:CHEMBL3822988
TypeSmall organic molecule
Emp. Form.C17H22N2O2
Mol. Mass.286.3688
SMILESCOc1cc(ccc1CN(C)C)-c1cc(C)c(=O)n(C)c1