Reaction Details
TargetChromatin remodeling regulator CECR2
LigandBDBM50183449
Substrate/Competitorn/a
Meas. Tech.ChEMBL_1586813 (CHEMBL3826498)
Kd 77±n/a nM
Citation Martin, LJKoegl, MBader, GCockcroft, XLFedorov, OFiegen, DGerstberger, THofmann, MHHohmann, AFKessler, DKnapp, SKnesl, PKornigg, SMüller, SNar, HRogers, CRumpel, KSchaaf, OSteurer, STallant, CVakoc, CRZeeb, MZoephel, APearson, MBoehmelt, GMcConnell, D Structure-Based Design of an in Vivo Active Selective BRD9 Inhibitor. J Med Chem59:4462-75 (2016) 
 
Chromatin remodeling regulator CECR2
Name:Chromatin remodeling regulator CECR2
Type:PROTEIN
Mol. Mass.:164223.89
Organism:Homo sapiens (Human)
Description:ChEMBL_107999
Residue:1484
BDBM50183449
NameBDBM50183449
Synonyms:CHEMBL3823101 | US11773085, Compound B23
TypeSmall organic molecule
Emp. Form.C20H23N3O3
Mol. Mass.353.4149
SMILESCOc1cc(c(OC)cc1CN(C)C)-c1cn(C)c(=O)c2cnccc12