Reaction Details
TargetBromodomain-containing protein 7
LigandBDBM50183449
Substrate/Competitorn/a
Meas. Tech.ChEMBL_1586806 (CHEMBL3826491)
Kd 239±n/a nM
Citation Martin, LJKoegl, MBader, GCockcroft, XLFedorov, OFiegen, DGerstberger, THofmann, MHHohmann, AFKessler, DKnapp, SKnesl, PKornigg, SMüller, SNar, HRogers, CRumpel, KSchaaf, OSteurer, STallant, CVakoc, CRZeeb, MZoephel, APearson, MBoehmelt, GMcConnell, D Structure-Based Design of an in Vivo Active Selective BRD9 Inhibitor. J Med Chem59:4462-75 (2016) 
 
Bromodomain-containing protein 7
Name:Bromodomain-containing protein 7
Type:PROTEIN
Mol. Mass.:74135.71
Organism:Homo sapiens (Human)
Description:ChEMBL_107970
Residue:651
BDBM50183449
NameBDBM50183449
Synonyms:CHEMBL3823101 | US11773085, Compound B23
TypeSmall organic molecule
Emp. Form.C20H23N3O3
Mol. Mass.353.4149
SMILESCOc1cc(c(OC)cc1CN(C)C)-c1cn(C)c(=O)c2cnccc12