Reaction Details
TargetCarbonic anhydrase 9
LigandBDBM50185298
Substrate/Competitorn/a
Meas. Tech.ChEMBL_1587515 (CHEMBL3825324)
Ki 4.8±n/a nM
Citation Akocak, SAlam, MRShabana, AMSanku, RKVullo, DThompson, HSwenson, ERSupuran, CTIlies, MA PEGylated Bis-Sulfonamide Carbonic Anhydrase Inhibitors Can Efficiently Control the Growth of Several Carbonic Anhydrase IX-Expressing Carcinomas. J Med Chem59:5077-88 (2016) 
 
Carbonic anhydrase 9
Name:Carbonic anhydrase 9
Type:Enzyme
Mol. Mass.:49669.03
Organism:Homo sapiens (Human)
Description:Catalytic domain of human cloned isozyme was used in the assay
Residue:459
BDBM50185298
NameBDBM50185298
Synonyms:CHEMBL3823514
TypeSmall organic molecule
Emp. Form.C112H208N6O53S2
Mol. Mass.2550.988
SMILESNS(=O)(=O)c1ccc(NC(=O)CCC(=O)NCCOCCOCCOCCOCCOCCOCCOCCOCCOCCOCCOCCOCCOCCOCCOCCOCCOCCOCCOCCOCCOCCOCCOCCOCCOCCOCCOCCOCCOCCOCCOCCOCCOCCOCCOCCOCCOCCOCCOCCOCCOCCOCCOCCOCCOCCNC(=O)CCC(=O)Nc2ccc(cc2)S(N)(=O)=O)cc1