Reaction Details
TargetCarbonic anhydrase 2
LigandBDBM50185302
Substrate/Competitorn/a
Meas. Tech.ChEMBL_1587513 (CHEMBL3825322)
Ki 9.3±n/a nM
Citation Akocak, SAlam, MRShabana, AMSanku, RKVullo, DThompson, HSwenson, ERSupuran, CTIlies, MA PEGylated Bis-Sulfonamide Carbonic Anhydrase Inhibitors Can Efficiently Control the Growth of Several Carbonic Anhydrase IX-Expressing Carcinomas. J Med Chem59:5077-88 (2016) 
 
Carbonic anhydrase 2
Name:Carbonic anhydrase 2
Type:Enzyme
Mol. Mass.:29250.71
Organism:Homo sapiens (Human)
Description:P00918
Residue:260
BDBM50185302
NameBDBM50185302
Synonyms:CHEMBL3823618
TypeSmall organic molecule
Emp. Form.C12H13N5O7S3
Mol. Mass.435.456
SMILESNS(=O)(=O)c1nnc(NS(=O)(=O)c2ccc(NC(=O)CCC(O)=O)cc2)s1