Reaction Details
TargetCarbonic anhydrase 12
LigandBDBM50185295
Substrate/Competitorn/a
Meas. Tech.ChEMBL_1587516 (CHEMBL3825325)
Ki 3.7±n/a nM
Citation Akocak, SAlam, MRShabana, AMSanku, RKVullo, DThompson, HSwenson, ERSupuran, CTIlies, MA PEGylated Bis-Sulfonamide Carbonic Anhydrase Inhibitors Can Efficiently Control the Growth of Several Carbonic Anhydrase IX-Expressing Carcinomas. J Med Chem59:5077-88 (2016) 
 
Carbonic anhydrase 12
Name:Carbonic anhydrase 12
Type:Enzyme
Mol. Mass.:39456.00
Organism:Homo sapiens (Human)
Description:Catalytic domain of human cloned isozyme was used in the assay
Residue:354
BDBM50185295
NameBDBM50185295
Synonyms:CHEMBL3822883
TypeSmall organic molecule
Emp. Form.C116H210N12O57S6
Mol. Mass.2877.345
SMILESNS(=O)(=O)c1nnc(NS(=O)(=O)c2ccc(NC(=O)CCC(=O)NCCOCCOCCOCCOCCOCCOCCOCCOCCOCCOCCOCCOCCOCCOCCOCCOCCOCCOCCOCCOCCOCCOCCOCCOCCOCCOCCOCCOCCOCCOCCOCCOCCOCCOCCOCCOCCOCCOCCOCCOCCOCCOCCOCCOCCOCCNC(=O)CCC(=O)Nc3ccc(cc3)S(=O)(=O)Nc3nnc(s3)S(N)(=O)=O)cc2)s1