Reaction Details
TargetAdenosine receptor A1
LigandBDBM50187585
Substrate/Competitorn/a
Meas. Tech.ChEBML_1590509
Ki 658±n/a nM
Citation Szymanska, EDrabczynska, AKarcz, TMüller, CEKöse, MKarolak-Wojciechowska, JFruzinski, ASchabikowski, JDoroz-Plonka, AHandzlik, JKiec-Kononowicz, K Similarities and differences in affinity and binding modes of tricyclic pyrimido- and pyrazinoxanthines at human and rat adenosine receptors. Bioorg Med Chem24:4347-4362 (2016) 
 
Adenosine receptor A1
Name:Adenosine receptor A1
Type:G Protein-Coupled Receptor (GPCR)
Mol. Mass.:36520.92
Organism:Homo sapiens (Human)
Description:P30542
Residue:326
BDBM50187585
NameBDBM50187585
Synonyms:CHEMBL3827074
TypeSmall organic molecule
Emp. Form.C28H40N6O3
Mol. Mass.508.6556
SMILESCCCCn1c2nc3N(CCCn3c2c(=O)n(CCCC)c1=O)c1ccc(OCCN2CCCC2)cc1