Reaction Details
TargetAdenosine receptor A1
LigandBDBM50187660
Substrate/Competitorn/a
Meas. Tech.ChEMBL_1590501 (CHEMBL3830977)
Ki 184±n/a nM
Citation Szymanska, EDrabczynska, AKarcz, TMüller, CEKöse, MKarolak-Wojciechowska, JFruzinski, ASchabikowski, JDoroz-Plonka, AHandzlik, JKiec-Kononowicz, K Similarities and differences in affinity and binding modes of tricyclic pyrimido- and pyrazinoxanthines at human and rat adenosine receptors. Bioorg Med Chem24:4347-4362 (2016) 
 
Adenosine receptor A1
Name:Adenosine receptor A1
Type:Protein
Mol. Mass.:36704.13
Organism:Rattus norvegicus (rat)
Description:n/a
Residue:326
BDBM50187660
NameBDBM50187660
Synonyms:CHEMBL3828002
TypeSmall organic molecule
Emp. Form.C24H33N5O3
Mol. Mass.439.5505
SMILESCCCCn1c2nc3N(CCc4ccc(O)cc4)CCCn3c2c(=O)n(CCCC)c1=O