Reaction Details
TargetSerine protease hepsin
LigandBDBM50106240
Substrate/Competitorn/a
Meas. Tech.ChEMBL_1589258 (CHEMBL3830286)
IC50 2600±n/a nM
Citation Subedi, MMinn, IChen, JKim, YOk, KJung, YWPomper, MGByun, Y Design, synthesis and biological evaluation of PSMA/hepsin-targeted heterobivalent ligands. Eur J Med Chem118:208-218 (2016) 
 
Serine protease hepsin
Name:Serine protease hepsin
Type:Enzyme
Mol. Mass.:45016.98
Organism:Homo sapiens (Human)
Description:Human deglycosylated hepsin was expressed in Pichia pastoris.
Residue:417
BDBM50106240
NameBDBM50106240
Synonyms:6-Chloro-2-(2-hydroxy-biphenyl-3-yl)-1H-indole-5-carboxamidine | CHEMBL339902
TypeSmall organic molecule
Emp. Form.C21H16ClN3O
Mol. Mass.361.824
SMILESNC(=N)c1cc2cc([nH]c2cc1Cl)-c1cccc(-c2ccccc2)c1O