Reaction Details
TargetHistone deacetylase 1
LigandBDBM50188638
Substrate/Competitorn/a
Meas. Tech.ChEMBL_1590558 (CHEMBL3828935)
IC50 10±n/a nM
Citation Chen, YWang, XXiang, WHe, LTang, MWang, FWang, TYang, ZYi, YWang, HNiu, TZheng, LLei, LLi, XSong, HChen, L Development of Purine-Based Hydroxamic Acid Derivatives: Potent Histone Deacetylase Inhibitors with Marked in Vitro and in Vivo Antitumor Activities. J Med Chem59:5488-504 (2016) 
 
Histone deacetylase 1
Name:Histone deacetylase 1
Type:Enzyme
Mol. Mass.:55090.27
Organism:Homo sapiens (Human)
Description:Q13547
Residue:482
BDBM50188638
NameBDBM50188638
Synonyms:CHEMBL3828070
TypeSmall organic molecule
Emp. Form.C27H33N9O3
Mol. Mass.531.6094
SMILESCN(Cc1nc2c(nc(nc2n1C)-c1ccc(cc1)C(C)(C)C)N1CCOCC1)c1ncc(cn1)C(=O)NO