Reaction Details
TargetHistone deacetylase 1
LigandBDBM50188639
Substrate/Competitorn/a
Meas. Tech.ChEMBL_1590558 (CHEMBL3828935)
IC50 6.2±n/a nM
Citation Chen, YWang, XXiang, WHe, LTang, MWang, FWang, TYang, ZYi, YWang, HNiu, TZheng, LLei, LLi, XSong, HChen, L Development of Purine-Based Hydroxamic Acid Derivatives: Potent Histone Deacetylase Inhibitors with Marked in Vitro and in Vivo Antitumor Activities. J Med Chem59:5488-504 (2016) 
 
Histone deacetylase 1
Name:Histone deacetylase 1
Type:Enzyme
Mol. Mass.:55090.27
Organism:Homo sapiens (Human)
Description:Q13547
Residue:482
BDBM50188639
NameBDBM50188639
Synonyms:CHEMBL3827489
TypeSmall organic molecule
Emp. Form.C26H31N9O3
Mol. Mass.517.5828
SMILESCCCc1ccc(cc1)-c1nc(N2CCOCC2)c2nc(CN(C)c3ncc(cn3)C(=O)NO)n(C)c2n1