Reaction Details
TargetHistone deacetylase 8
LigandBDBM29589
Substrate/Competitorn/a
Meas. Tech.ChEMBL_1590565 (CHEMBL3829034)
IC50 4.9±n/a nM
Citation Chen, YWang, XXiang, WHe, LTang, MWang, FWang, TYang, ZYi, YWang, HNiu, TZheng, LLei, LLi, XSong, HChen, L Development of Purine-Based Hydroxamic Acid Derivatives: Potent Histone Deacetylase Inhibitors with Marked in Vitro and in Vivo Antitumor Activities. J Med Chem59:5488-504 (2016) 
 
Histone deacetylase 8
Name:Histone deacetylase 8
Type:Enzyme
Mol. Mass.:41749.60
Organism:Homo sapiens (Human)
Description:Q9BY41
Residue:377
BDBM29589
NameBDBM29589
Synonyms:Faridak LBH-589B US10722597, Compound Panobinostat
TypeSmall organic molecule
Emp. Form.C21H23N3O2
Mol. Mass.349.4262
SMILESCc1[nH]c2ccccc2c1CCNCc1ccc(\C=C\C(=O)NO)cc1