Reaction Details
TargetHistone deacetylase 1
LigandBDBM50188906
Substrate/Competitorn/a
Meas. Tech.ChEMBL_1590558 (CHEMBL3828935)
IC50 2.6±n/a nM
Citation Chen, YWang, XXiang, WHe, LTang, MWang, FWang, TYang, ZYi, YWang, HNiu, TZheng, LLei, LLi, XSong, HChen, L Development of Purine-Based Hydroxamic Acid Derivatives: Potent Histone Deacetylase Inhibitors with Marked in Vitro and in Vivo Antitumor Activities. J Med Chem59:5488-504 (2016) 
 
Histone deacetylase 1
Name:Histone deacetylase 1
Type:Enzyme
Mol. Mass.:55090.27
Organism:Homo sapiens (Human)
Description:Q13547
Residue:482
BDBM50188906
NameBDBM50188906
Synonyms:CHEMBL3828482
TypeSmall organic molecule
Emp. Form.C22H26N12O3
Mol. Mass.506.5204
SMILESCCn1c(CN(C)c2ncc(cn2)C(=O)NO)nc2c(nc(nc12)-c1cnc(N)nc1)N1CCOCC1