Reaction Details
TargetHistone deacetylase 1
LigandBDBM50188904
Substrate/Competitorn/a
Meas. Tech.ChEMBL_1590558 (CHEMBL3828935)
IC50 165±n/a nM
Citation Chen, YWang, XXiang, WHe, LTang, MWang, FWang, TYang, ZYi, YWang, HNiu, TZheng, LLei, LLi, XSong, HChen, L Development of Purine-Based Hydroxamic Acid Derivatives: Potent Histone Deacetylase Inhibitors with Marked in Vitro and in Vivo Antitumor Activities. J Med Chem59:5488-504 (2016) 
 
Histone deacetylase 1
Name:Histone deacetylase 1
Type:Enzyme
Mol. Mass.:55090.27
Organism:Homo sapiens (Human)
Description:Q13547
Residue:482
BDBM50188904
NameBDBM50188904
Synonyms:CHEMBL3827881
TypeSmall organic molecule
Emp. Form.C25H30N10O3
Mol. Mass.518.5709
SMILESCC(C)n1c(CN(C)c2ncc(cn2)C(=O)NO)nc2c(nc(nc12)-c1ccc(N)cc1)N1CCOCC1