Reaction Details
TargetPeregrin
LigandBDBM50189406
Substrate/Competitorn/a
Meas. Tech.ChEMBL_1589340 (CHEMBL3830584)
IC50 126±n/a nM
Citation Bamborough, PBarnett, HABecher, IBird, MJChung, CWCraggs, PDDemont, EHDiallo, HFallon, DJGordon, LJGrandi, PHobbs, CIHooper-Greenhill, EJones, EJLaw, RPLe Gall, ALugo, DMichon, AMMitchell, DJPrinjha, RKSheppard, RJWatson, AJWatson, RJ GSK6853, a Chemical Probe for Inhibition of the BRPF1 Bromodomain. ACS Med Chem Lett7:552-7 (2016) 
 
Peregrin
Name:Peregrin
Type:PROTEIN
Mol. Mass.:137524.47
Organism:Homo sapiens (Human)
Description:ChEMBL_108054
Residue:1214
BDBM50189406
NameBDBM50189406
Synonyms:CHEMBL3827280
TypeSmall organic molecule
Emp. Form.C22H27N5O3
Mol. Mass.409.4815
SMILESCOc1ccccc1C(=O)Nc1cc2n(C)c(=O)n(C)c2cc1N1CCN[C@H](C)C1