Reaction Details
TargetPeregrin
LigandBDBM50189408
Substrate/Competitorn/a
Meas. Tech.ChEMBL_1589340 (CHEMBL3830584)
IC50 50±n/a nM
Citation Bamborough, PBarnett, HABecher, IBird, MJChung, CWCraggs, PDDemont, EHDiallo, HFallon, DJGordon, LJGrandi, PHobbs, CIHooper-Greenhill, EJones, EJLaw, RPLe Gall, ALugo, DMichon, AMMitchell, DJPrinjha, RKSheppard, RJWatson, AJWatson, RJ GSK6853, a Chemical Probe for Inhibition of the BRPF1 Bromodomain. ACS Med Chem Lett7:552-7 (2016) 
 
Peregrin
Name:Peregrin
Type:PROTEIN
Mol. Mass.:137524.47
Organism:Homo sapiens (Human)
Description:ChEMBL_108054
Residue:1214
BDBM50189408
NameBDBM50189408
Synonyms:CHEMBL3828194
TypeSmall organic molecule
Emp. Form.C19H22N4O3
Mol. Mass.354.403
SMILESCOc1ccccc1C(=O)Nc1cc2n(C)c(=O)n(C)c2cc1N(C)C