Reaction Details
TargetPeregrin
LigandBDBM50189407
Substrate/Competitorn/a
Meas. Tech.ChEMBL_1589348 (CHEMBL3830592)
IC50 3981±n/a nM
Citation Bamborough, PBarnett, HABecher, IBird, MJChung, CWCraggs, PDDemont, EHDiallo, HFallon, DJGordon, LJGrandi, PHobbs, CIHooper-Greenhill, EJones, EJLaw, RPLe Gall, ALugo, DMichon, AMMitchell, DJPrinjha, RKSheppard, RJWatson, AJWatson, RJ GSK6853, a Chemical Probe for Inhibition of the BRPF1 Bromodomain. ACS Med Chem Lett7:552-7 (2016) 
 
Peregrin
Name:Peregrin
Type:PROTEIN
Mol. Mass.:137524.47
Organism:Homo sapiens (Human)
Description:ChEMBL_108054
Residue:1214
BDBM50189407
NameBDBM50189407
Synonyms:CHEMBL3827932
TypeSmall organic molecule
Emp. Form.C24H31N5O3
Mol. Mass.437.5346
SMILESCCN(C(=O)c1ccccc1OC)c1cc2n(C)c(=O)n(C)c2cc1N1CCNC[C@H]1C