Reaction Details
TargetCyclin-C
LigandBDBM50189412
Substrate/Competitorn/a
Meas. Tech.ChEMBL_1589659 (CHEMBL3829688)
IC50 3.6±n/a nM
Citation Mallinger, ASchiemann, KRink, CSejberg, JHoney, MACzodrowski, PStubbs, MPoeschke, OBusch, MSchneider, RSchwarz, DMusil, DBurke, RUrbahns, KWorkman, PWienke, DClarke, PARaynaud, FIEccles, SAEsdar, CRohdich, FBlagg, J 2,8-Disubstituted-1,6-Naphthyridines and 4,6-Disubstituted-Isoquinolines with Potent, Selective Affinity for CDK8/19. ACS Med Chem Lett7:573-8 (2016) 
 
Cyclin-C
Name:Cyclin-C
Type:PROTEIN
Mol. Mass.:33244.88
Organism:Homo sapiens (Human)
Description:ChEMBL_107900
Residue:283
BDBM50189412
NameBDBM50189412
Synonyms:CHEMBL3827983
TypeSmall organic molecule
Emp. Form.C20H17N5O
Mol. Mass.343.3819
SMILESCNC(=O)c1ccc2cncc(-c3ccc(cc3)-c3cnn(C)c3)c2n1