Reaction Details
TargetCyclin-C
LigandBDBM50189436
Substrate/Competitorn/a
Meas. Tech.ChEMBL_1589659 (CHEMBL3829688)
IC50 2.1±n/a nM
Citation Mallinger, ASchiemann, KRink, CSejberg, JHoney, MACzodrowski, PStubbs, MPoeschke, OBusch, MSchneider, RSchwarz, DMusil, DBurke, RUrbahns, KWorkman, PWienke, DClarke, PARaynaud, FIEccles, SAEsdar, CRohdich, FBlagg, J 2,8-Disubstituted-1,6-Naphthyridines and 4,6-Disubstituted-Isoquinolines with Potent, Selective Affinity for CDK8/19. ACS Med Chem Lett7:573-8 (2016) 
 
Cyclin-C
Name:Cyclin-C
Type:PROTEIN
Mol. Mass.:33244.88
Organism:Homo sapiens (Human)
Description:ChEMBL_107900
Residue:283
BDBM50189436
NameBDBM50189436
Synonyms:CHEMBL3827327
TypeSmall organic molecule
Emp. Form.C23H20N4O
Mol. Mass.368.4311
SMILESCn1cc(cn1)-c1ccc(cc1)-c1cncc2ccc(cc12)C(=O)NC1CC1