Reaction Details
TargetRhodopsin kinase GRK1
LigandBDBM3149
Substrate/Competitorn/a
Meas. Tech.ChEMBL_1612806 (CHEMBL3854606)
IC50 4100±n/a nM
Citation Guccione, MEttari, RTaliani, SDa Settimo, FZappalą, MGrasso, S G-Protein-Coupled Receptor Kinase 2 (GRK2) Inhibitors: Current Trends and Future Perspectives. J Med Chem59:9277-9294 (2016) Rhodopsin kinase GRK1
Name:Rhodopsin kinase GRK1
Type:PROTEIN
Mol. Mass.:62931.24
Organism:Bos taurus
Description:ChEMBL_116985
Residue:561
BDBM3149
NameBDBM3149
Synonyms:2-{[2,6-dihydroxy-4-({[(3R,4R)-3-[(4-hydroxybenzene)amido]azepan-4-yl]oxy}carbonyl)phenyl]carbonyl}-3-hydroxybenzoic acid Balanol analog 1 CHEMBL60254
TypeSmall organic molecule
Emp. Form.C28H26N2O10
Mol. Mass.550.5134
SMILESOC(=O)c1cccc(O)c1C(=O)c1c(O)cc(cc1O)C(=O)O[C@@H]1CCCNC[C@H]1NC(=O)c1ccc(O)cc1