Reaction Details
TargetUrokinase-type plasminogen activator
LigandBDBM189434
Substrate/Competitorn/a
Meas. Tech.ChEMBL_1612874 (CHEMBL3854674)
Ki 15000±n/a nM
Citation Zhang, XGlunz, PWJohnson, JAJiang, WJacutin-Porte, SLadziata, VZou, YPhillips, MSWurtz, NRParkhurst, BRendina, ARHarper, TMCheney, DLLuettgen, JMWong, PCSeiffert, DWexler, RRPriestley, ES Discovery of a Highly Potent, Selective, and Orally Bioavailable Macrocyclic Inhibitor of Blood Coagulation Factor VIIa-Tissue Factor Complex. J Med Chem59:7125-37 (2016) 
 
Urokinase-type plasminogen activator
Name:Urokinase-type plasminogen activator
Type:Enzyme
Mol. Mass.:48528.62
Organism:Homo sapiens (Human)
Description:P00749
Residue:431
BDBM189434
NameBDBM189434
Synonyms:US9174974, Example 19
TypeSmall organic molecule
Emp. Form.C33H34FN5O5S
Mol. Mass.631.717
SMILESC[C@H]1COC(=O)Nc2ccc(c(CN(C)C(=O)[C@H](Nc3ccc4c(N)ncc(F)c4c3)c3ccc1c(C)c3)c2)S(=O)(=O)C1CC1