Reaction Details
TargetKallikrein-1
LigandBDBM50191346
Substrate/Competitorn/a
Meas. Tech.ChEMBL_1612859 (CHEMBL3854659)
Ki 2600±n/a nM
Citation Zhang, XGlunz, PWJohnson, JAJiang, WJacutin-Porte, SLadziata, VZou, YPhillips, MSWurtz, NRParkhurst, BRendina, ARHarper, TMCheney, DLLuettgen, JMWong, PCSeiffert, DWexler, RRPriestley, ES Discovery of a Highly Potent, Selective, and Orally Bioavailable Macrocyclic Inhibitor of Blood Coagulation Factor VIIa-Tissue Factor Complex. J Med Chem59:7125-37 (2016) 
 
Kallikrein-1
Name:Kallikrein-1
Type:Enzyme
Mol. Mass.:28874.69
Organism:Homo sapiens (Human)
Description:P06870
Residue:262
BDBM50191346
NameBDBM50191346
Synonyms:CHEMBL3978562
TypeSmall organic molecule
Emp. Form.C32H36N5O6P
Mol. Mass.617.6319
SMILESCCOP(O)(=O)c1ccc2NC(=O)OC[C@H](C)c3ccc(cc3C)[C@@H](Nc3ccc4c(N)nccc4c3)C(=O)N(C)Cc1c2