Reaction Details
TargetProthrombin
LigandBDBM189429
Substrate/Competitorn/a
Meas. Tech.ChEMBL_1612857 (CHEMBL3854657)
Ki>10000±n/a nM
Citation Zhang, XGlunz, PWJohnson, JAJiang, WJacutin-Porte, SLadziata, VZou, YPhillips, MSWurtz, NRParkhurst, BRendina, ARHarper, TMCheney, DLLuettgen, JMWong, PCSeiffert, DWexler, RRPriestley, ES Discovery of a Highly Potent, Selective, and Orally Bioavailable Macrocyclic Inhibitor of Blood Coagulation Factor VIIa-Tissue Factor Complex. J Med Chem59:7125-37 (2016) 
 
Prothrombin
Name:Prothrombin
Type:Protein
Mol. Mass.:70029.57
Organism:Homo sapiens (Human)
Description:P00734
Residue:622
BDBM189429
NameBDBM189429
Synonyms:US9174974, Example 14
TypeSmall organic molecule
Emp. Form.C35H40N6O4
Mol. Mass.608.7299
SMILESCCN(CC)C(=O)c1ccc2NC(=O)OC[C@H](C)c3ccc(cc3C)[C@@H](Nc3ccc4c(N)nccc4c3)C(=O)N(C)Cc1c2