Reaction Details
TargetCyclin-dependent kinase 8
LigandBDBM50191357
Substrate/Competitorn/a
Meas. Tech.ChEMBL_1613022 (CHEMBL3854822)
IC50 8.0±n/a nM
Citation Czodrowski, PMallinger, AWienke, DEsdar, CPöschke, OBusch, MRohdich, FEccles, SAOrtiz-Ruiz, MJSchneider, RRaynaud, FIClarke, PAMusil, DSchwarz, DDale, TUrbahns, KBlagg, JSchiemann, K Structure-Based Optimization of Potent, Selective, and Orally Bioavailable CDK8 Inhibitors Discovered by High-Throughput Screening. J Med Chem59:9337-9349 (2016) Cyclin-dependent kinase 8
Name:Cyclin-dependent kinase 8
Type:Serine/threonine-protein kinase
Mol. Mass.:53300.21
Organism:Homo sapiens (Human)
Description:P49336
Residue:464
BDBM50191357
NameBDBM50191357
Synonyms:CHEMBL3903492
TypeSmall organic molecule
Emp. Form.C18H17ClN4O
Mol. Mass.340.807
SMILESCc1n[nH]c2ncc(cc12)C(=O)N1CCC[C@H]1c1ccc(Cl)cc1