Reaction Details
TargetEpidermal growth factor receptor
LigandBDBM50191486
Substrate/Competitorn/a
Meas. Tech.ChEMBL_1613063 (CHEMBL3854863)
IC50 7.0±n/a nM
Citation Smaill, JBGonzales, AJSpicer, JALee, HReed, JESexton, KAlthaus, IWZhu, TBlack, SLBlaser, ADenny, WAEllis, PAFakhoury, SHarvey, PJHook, KMcCarthy, FOPalmer, BDRivault, FSchlosser, KEllis, TThompson, AMTrachet, EWinters, RTTecle, HBridges, A Tyrosine Kinase Inhibitors. 20. Optimization of Substituted Quinazoline and Pyrido[3,4-d]pyrimidine Derivatives as Orally Active, Irreversible Inhibitors of the Epidermal Growth Factor Receptor Family. J Med Chem59:8103-24 (2016) 
 
Epidermal growth factor receptor
Name:Epidermal growth factor receptor
Type:Receptor Kinase Domain
Mol. Mass.:134279.59
Organism:Homo sapiens (Human)
Description:P00533
Residue:1210
BDBM50191486
NameBDBM50191486
Synonyms:CHEMBL3959248
TypeSmall organic molecule
Emp. Form.C31H33N7O3
Mol. Mass.551.6388
SMILESCOCCOc1cc2ncnc(Nc3ccc4n(Cc5ccccc5)ncc4c3)c2cc1NC(=O)\C=C\CN(C)C