Reaction Details
TargetReceptor tyrosine-protein kinase erbB-2
LigandBDBM50191498
Substrate/Competitorn/a
Meas. Tech.ChEMBL_1613064 (CHEMBL3854864)
IC50 27±n/a nM
Citation Smaill, JBGonzales, AJSpicer, JALee, HReed, JESexton, KAlthaus, IWZhu, TBlack, SLBlaser, ADenny, WAEllis, PAFakhoury, SHarvey, PJHook, KMcCarthy, FOPalmer, BDRivault, FSchlosser, KEllis, TThompson, AMTrachet, EWinters, RTTecle, HBridges, A Tyrosine Kinase Inhibitors. 20. Optimization of Substituted Quinazoline and Pyrido[3,4-d]pyrimidine Derivatives as Orally Active, Irreversible Inhibitors of the Epidermal Growth Factor Receptor Family. J Med Chem59:8103-24 (2016) 
 
Receptor tyrosine-protein kinase erbB-2
Name:Receptor tyrosine-protein kinase erbB-2
Type:n/a
Mol. Mass.:137894.47
Organism:Homo sapiens (Human)
Description:P04626
Residue:1255
BDBM50191498
NameBDBM50191498
Synonyms:CHEMBL3907533
TypeSmall organic molecule
Emp. Form.C32H33N7O3
Mol. Mass.563.6495
SMILESCCOc1cc2ncnc(Nc3ccc4n(Cc5ccccc5)ncc4c3)c2cc1NC(=O)\C=C\CN1CCOCC1