Reaction Details
TargetReceptor tyrosine-protein kinase erbB-4
LigandBDBM50191476
Substrate/Competitorn/a
Meas. Tech.ChEMBL_1613065 (CHEMBL3854865)
IC50 5.0±n/a nM
Citation Smaill, JBGonzales, AJSpicer, JALee, HReed, JESexton, KAlthaus, IWZhu, TBlack, SLBlaser, ADenny, WAEllis, PAFakhoury, SHarvey, PJHook, KMcCarthy, FOPalmer, BDRivault, FSchlosser, KEllis, TThompson, AMTrachet, EWinters, RTTecle, HBridges, A Tyrosine Kinase Inhibitors. 20. Optimization of Substituted Quinazoline and Pyrido[3,4-d]pyrimidine Derivatives as Orally Active, Irreversible Inhibitors of the Epidermal Growth Factor Receptor Family. J Med Chem59:8103-24 (2016) 
 
Receptor tyrosine-protein kinase erbB-4
Name:Receptor tyrosine-protein kinase erbB-4
Type:Protein
Mol. Mass.:146803.56
Organism:Homo sapiens (Human)
Description:Q15303
Residue:1308
BDBM50191476
NameBDBM50191476
Synonyms:CHEMBL3904257
TypeSmall organic molecule
Emp. Form.C28H26ClFN6O2
Mol. Mass.532.996
SMILESFc1cccc(COc2ccc(Nc3ncnc4cnc(NC(=O)\C=C\CN5CCCC5)cc34)cc2Cl)c1