Reaction Details
TargetPhosphatidylinositol 4,5-bisphosphate 3-kinase catalytic subunit gamma isoform
LigandBDBM50192884
Substrate/Competitorn/a
Meas. Tech.ChEMBL_1613926 (CHEMBL3855726)
IC50 1000±n/a nM
Citation Evans, CALiu, TLescarbeau, ANair, SJGrenier, LPradeilles, JAGlenadel, QTibbitts, TRowley, AMDiNitto, JPBrophy, EEO'Hearn, ELAli, JAWinkler, DGGoldstein, SIO'Hearn, PMartin, CMHoyt, JGSoglia, JRCheung, CPink, MMProctor, JLPalombella, VJTremblay, MRCastro, AC Discovery of a Selective Phosphoinositide-3-Kinase (PI3K)-¿ Inhibitor (IPI-549) as an Immuno-Oncology Clinical Candidate. ACS Med Chem Lett7:862-7 (2016) 
 
Phosphatidylinositol 4,5-bisphosphate 3-kinase catalytic subunit gamma isoform
Name:Phosphatidylinositol 4,5-bisphosphate 3-kinase catalytic subunit gamma isoform
Type:Enzyme Subunit
Mol. Mass.:126470.30
Organism:Homo sapiens (Human)
Description:P48736
Residue:1102
BDBM50192884
NameBDBM50192884
Synonyms:CHEMBL3978650
TypeSmall organic molecule
Emp. Form.C26H19ClN4O2
Mol. Mass.454.908
SMILESC[C@H](NC(=O)c1cncc2cccnc12)c1cc2cccc(Cl)c2c(=O)n1-c1ccccc1