Reaction Details
TargetInsulin receptor
LigandBDBM50193824
Substrate/Competitorn/a
Meas. Tech.ChEMBL_1616171 (CHEMBL3858240)
IC50 722±n/a nM
Citation Ott, GRCheng, MLearn, KSWagner, JGingrich, DELisko, JGCurry, MMesaros, EFGhose, AKQuail, MRWan, WLu, LDobrzanski, PAlbom, MSAngeles, TSWells-Knecht, KHuang, ZAimone, LDBruckheimer, EAnderson, NFriedman, JFernandez, SVAtor, MARuggeri, BADorsey, BD Discovery of Clinical Candidate CEP-37440, a Selective Inhibitor of Focal Adhesion Kinase (FAK) and Anaplastic Lymphoma Kinase (ALK). J Med Chem59:7478-96 (2016) 
 
Insulin receptor
Name:Insulin receptor
Type:Receptor Tyrosine Kinase
Mol. Mass.:156322.60
Organism:Homo sapiens (Human)
Description:P06213
Residue:1382
BDBM50193824
NameBDBM50193824
Synonyms:CHEMBL3961598
TypeSmall organic molecule
Emp. Form.C32H39ClN8O2
Mol. Mass.603.157
SMILESCOc1c(Nc2ncc(Cl)c(Nc3ccccc3-c3nccn3C)n2)ccc2CC(CCCc12)N1CCN(CCO)CC1