Reaction Details
TargetFocal adhesion kinase 1
LigandBDBM50193820
Substrate/Competitorn/a
Meas. Tech.ChEMBL_1616175 (CHEMBL3858244)
IC50 42±n/a nM
Citation Ott, GRCheng, MLearn, KSWagner, JGingrich, DELisko, JGCurry, MMesaros, EFGhose, AKQuail, MRWan, WLu, LDobrzanski, PAlbom, MSAngeles, TSWells-Knecht, KHuang, ZAimone, LDBruckheimer, EAnderson, NFriedman, JFernandez, SVAtor, MARuggeri, BADorsey, BD Discovery of Clinical Candidate CEP-37440, a Selective Inhibitor of Focal Adhesion Kinase (FAK) and Anaplastic Lymphoma Kinase (ALK). J Med Chem59:7478-96 (2016) 
 
Focal adhesion kinase 1
Name:Focal adhesion kinase 1
Type:Tyrosine-protein kinase
Mol. Mass.:119233.17
Organism:Homo sapiens (Human)
Description:Q05397
Residue:1052
BDBM50193820
NameBDBM50193820
Synonyms:CHEMBL3943066
TypeSmall organic molecule
Emp. Form.C29H37ClN6O3
Mol. Mass.553.095
SMILESCOc1ccccc1Nc1nc(Nc2ccc3CC(CCCc3c2OC)N2CCN(CCO)CC2)ncc1Cl