Reaction Details
TargetFocal adhesion kinase 1
LigandBDBM50193810
Substrate/Competitorn/a
Meas. Tech.ChEMBL_1616175 (CHEMBL3858244)
IC50 1.000000±n/a nM
Citation Ott, GRCheng, MLearn, KSWagner, JGingrich, DELisko, JGCurry, MMesaros, EFGhose, AKQuail, MRWan, WLu, LDobrzanski, PAlbom, MSAngeles, TSWells-Knecht, KHuang, ZAimone, LDBruckheimer, EAnderson, NFriedman, JFernandez, SVAtor, MARuggeri, BADorsey, BD Discovery of Clinical Candidate CEP-37440, a Selective Inhibitor of Focal Adhesion Kinase (FAK) and Anaplastic Lymphoma Kinase (ALK). J Med Chem59:7478-96 (2016) 
 
Focal adhesion kinase 1
Name:Focal adhesion kinase 1
Type:Tyrosine-protein kinase
Mol. Mass.:119233.17
Organism:Homo sapiens (Human)
Description:Q05397
Residue:1052
BDBM50193810
NameBDBM50193810
Synonyms:CHEMBL3972653
TypeSmall organic molecule
Emp. Form.C30H38ClN7O3
Mol. Mass.580.121
SMILESCNC(=O)c1ccccc1Nc1nc(Nc2ccc3C[C@@H](CCCc3c2OC)N2CCN(CCO)CC2)ncc1Cl