Reaction Details
TargetCytochrome P450 2C9
LigandBDBM50193814
Substrate/Competitorn/a
Meas. Tech.ChEMBL_1616178 (CHEMBL3858247)
IC50>10000±n/a nM
Citation Ott, GRCheng, MLearn, KSWagner, JGingrich, DELisko, JGCurry, MMesaros, EFGhose, AKQuail, MRWan, WLu, LDobrzanski, PAlbom, MSAngeles, TSWells-Knecht, KHuang, ZAimone, LDBruckheimer, EAnderson, NFriedman, JFernandez, SVAtor, MARuggeri, BADorsey, BD Discovery of Clinical Candidate CEP-37440, a Selective Inhibitor of Focal Adhesion Kinase (FAK) and Anaplastic Lymphoma Kinase (ALK). J Med Chem59:7478-96 (2016) 
 
Cytochrome P450 2C9
Name:Cytochrome P450 2C9
Type:Enzyme
Mol. Mass.:55636.33
Organism:Homo sapiens (Human)
Description:P11712
Residue:490
BDBM50193814
NameBDBM50193814
Synonyms:CHEMBL3980825
TypeSmall organic molecule
Emp. Form.C29H38ClN7O2
Mol. Mass.552.111
SMILES[H][C@@]12C[C@@]([H])(C=C1)[C@@H]([C@@H]2Nc1nc(Nc2ccc3C[C@@H](CCCc3c2OC)N2CCN(C)CC2)ncc1Cl)C(N)=O