Reaction Details
TargetALK tyrosine kinase receptor
LigandBDBM50193813
Substrate/Competitorn/a
Meas. Tech.ChEMBL_1616174 (CHEMBL3858243)
IC50 20±n/a nM
Citation Ott, GRCheng, MLearn, KSWagner, JGingrich, DELisko, JGCurry, MMesaros, EFGhose, AKQuail, MRWan, WLu, LDobrzanski, PAlbom, MSAngeles, TSWells-Knecht, KHuang, ZAimone, LDBruckheimer, EAnderson, NFriedman, JFernandez, SVAtor, MARuggeri, BADorsey, BD Discovery of Clinical Candidate CEP-37440, a Selective Inhibitor of Focal Adhesion Kinase (FAK) and Anaplastic Lymphoma Kinase (ALK). J Med Chem59:7478-96 (2016) 
 
ALK tyrosine kinase receptor
Name:ALK tyrosine kinase receptor
Type:Protein
Mol. Mass.:176453.10
Organism:Homo sapiens (Human)
Description:Q9UM73
Residue:1620
BDBM50193813
NameBDBM50193813
Synonyms:CHEMBL3934099
TypeSmall organic molecule
Emp. Form.C31H37ClN8O2
Mol. Mass.589.131
SMILESCOc1c(Nc2ncc(Cl)c(Nc3ccccc3-n3cccn3)n2)ccc2CC(CCCc12)N1CCN(CCO)CC1