Reaction Details
TargetInsulin receptor
LigandBDBM50193825
Substrate/Competitorn/a
Meas. Tech.ChEMBL_1616171 (CHEMBL3858240)
IC50>2000±n/a nM
Citation Ott, GRCheng, MLearn, KSWagner, JGingrich, DELisko, JGCurry, MMesaros, EFGhose, AKQuail, MRWan, WLu, LDobrzanski, PAlbom, MSAngeles, TSWells-Knecht, KHuang, ZAimone, LDBruckheimer, EAnderson, NFriedman, JFernandez, SVAtor, MARuggeri, BADorsey, BD Discovery of Clinical Candidate CEP-37440, a Selective Inhibitor of Focal Adhesion Kinase (FAK) and Anaplastic Lymphoma Kinase (ALK). J Med Chem59:7478-96 (2016) 
 
Insulin receptor
Name:Insulin receptor
Type:Receptor Tyrosine Kinase
Mol. Mass.:156322.60
Organism:Homo sapiens (Human)
Description:P06213
Residue:1382
BDBM50193825
NameBDBM50193825
Synonyms:CHEMBL3953048
TypeSmall organic molecule
Emp. Form.C29H38ClN7O4S
Mol. Mass.616.175
SMILESCOc1c(Nc2ncc(Cl)c(Nc3ccccc3NS(C)(=O)=O)n2)ccc2CC(CCCc12)N1CCN(CCO)CC1