Reaction Details
TargetALK tyrosine kinase receptor
LigandBDBM50193815
Substrate/Competitorn/a
Meas. Tech.ChEMBL_1616174 (CHEMBL3858243)
IC50 50±n/a nM
Citation Ott, GRCheng, MLearn, KSWagner, JGingrich, DELisko, JGCurry, MMesaros, EFGhose, AKQuail, MRWan, WLu, LDobrzanski, PAlbom, MSAngeles, TSWells-Knecht, KHuang, ZAimone, LDBruckheimer, EAnderson, NFriedman, JFernandez, SVAtor, MARuggeri, BADorsey, BD Discovery of Clinical Candidate CEP-37440, a Selective Inhibitor of Focal Adhesion Kinase (FAK) and Anaplastic Lymphoma Kinase (ALK). J Med Chem59:7478-96 (2016) 
 
ALK tyrosine kinase receptor
Name:ALK tyrosine kinase receptor
Type:Protein
Mol. Mass.:176453.10
Organism:Homo sapiens (Human)
Description:Q9UM73
Residue:1620
BDBM50193815
NameBDBM50193815
Synonyms:CHEMBL3943236
TypeSmall organic molecule
Emp. Form.C30H40ClN7O3
Mol. Mass.582.137
SMILES[H][C@@]12C[C@@]([H])(C=C1)[C@@H]([C@@H]2Nc1nc(Nc2ccc3C[C@@H](CCCc3c2OC)N2CCN(CCO)CC2)ncc1Cl)C(N)=O