Reaction Details
TargetFocal adhesion kinase 1
LigandBDBM50193813
Substrate/Competitorn/a
Meas. Tech.ChEMBL_1616175 (CHEMBL3858244)
IC50 7.0±n/a nM
Citation Ott, GRCheng, MLearn, KSWagner, JGingrich, DELisko, JGCurry, MMesaros, EFGhose, AKQuail, MRWan, WLu, LDobrzanski, PAlbom, MSAngeles, TSWells-Knecht, KHuang, ZAimone, LDBruckheimer, EAnderson, NFriedman, JFernandez, SVAtor, MARuggeri, BADorsey, BD Discovery of Clinical Candidate CEP-37440, a Selective Inhibitor of Focal Adhesion Kinase (FAK) and Anaplastic Lymphoma Kinase (ALK). J Med Chem59:7478-96 (2016) 
 
Focal adhesion kinase 1
Name:Focal adhesion kinase 1
Type:Tyrosine-protein kinase
Mol. Mass.:119233.17
Organism:Homo sapiens (Human)
Description:Q05397
Residue:1052
BDBM50193813
NameBDBM50193813
Synonyms:CHEMBL3934099
TypeSmall organic molecule
Emp. Form.C31H37ClN8O2
Mol. Mass.589.131
SMILESCOc1c(Nc2ncc(Cl)c(Nc3ccccc3-n3cccn3)n2)ccc2CC(CCCc12)N1CCN(CCO)CC1