Reaction Details
TargetCytochrome P450 2D6
LigandBDBM50193808
Substrate/Competitorn/a
Meas. Tech.ChEMBL_1616180 (CHEMBL3858249)
IC50>10000±n/a nM
Citation Ott, GRCheng, MLearn, KSWagner, JGingrich, DELisko, JGCurry, MMesaros, EFGhose, AKQuail, MRWan, WLu, LDobrzanski, PAlbom, MSAngeles, TSWells-Knecht, KHuang, ZAimone, LDBruckheimer, EAnderson, NFriedman, JFernandez, SVAtor, MARuggeri, BADorsey, BD Discovery of Clinical Candidate CEP-37440, a Selective Inhibitor of Focal Adhesion Kinase (FAK) and Anaplastic Lymphoma Kinase (ALK). J Med Chem59:7478-96 (2016) 
 
Cytochrome P450 2D6
Name:Cytochrome P450 2D6
Type:Protein
Mol. Mass.:55774.82
Organism:Homo sapiens (Human)
Description:P10635
Residue:497
BDBM50193808
NameBDBM50193808
Synonyms:CHEMBL3936443
TypeSmall organic molecule
Emp. Form.C29H38ClN7O2
Mol. Mass.552.111
SMILES[H][C@@]12C[C@@]([H])(C=C1)[C@@H]([C@@H]2Nc1nc(Nc2ccc3C[C@H](CCCc3c2OC)N2CCN(C)CC2)ncc1Cl)C(N)=O