Reaction Details
TargetInduced myeloid leukemia cell differentiation protein Mcl-1
LigandBDBM50195309
Substrate/Competitorn/a
Meas. Tech.ChEMBL_1617652 (CHEMBL3859721)
Ki 1600±n/a nM
Citation Wang, MTian, WWang, CLu, SYang, CWang, JSong, YZhou, YZhu, JLi, ZZheng, C Design, synthesis, and activity evaluation of selective inhibitors of anti-apoptotic Bcl-2 proteins: The effects on the selectivity of the P1 pockets in the active sites. Bioorg Med Chem Lett26:5207-5211 (2016) 
 
Induced myeloid leukemia cell differentiation protein Mcl-1
Name:Induced myeloid leukemia cell differentiation protein Mcl-1
Type:Membrane; Single-pass membrane protein
Mol. Mass.:37332.87
Organism:Homo sapiens (Human)
Description:Q07820
Residue:350
BDBM50195309
NameBDBM50195309
Synonyms:CHEMBL3900077
TypeSmall organic molecule
Emp. Form.C30H26N4O6S2
Mol. Mass.602.681
SMILES[O-][N+](=O)c1cc(ccc1NCCSc1ccccc1)S(=O)(=O)NC(=O)c1ccc(NC(=O)\C=C\c2ccccc2)cc1