Reaction Details
TargetBcl-2-like protein 1
LigandBDBM50195311
Substrate/Competitorn/a
Meas. Tech.ChEMBL_1617651 (CHEMBL3859720)
Ki 210±n/a nM
Citation Wang, MTian, WWang, CLu, SYang, CWang, JSong, YZhou, YZhu, JLi, ZZheng, C Design, synthesis, and activity evaluation of selective inhibitors of anti-apoptotic Bcl-2 proteins: The effects on the selectivity of the P1 pockets in the active sites. Bioorg Med Chem Lett26:5207-5211 (2016) 
 
Bcl-2-like protein 1
Name:Bcl-2-like protein 1
Type:Mitochondrion membrane; Single-pass membrane protein
Mol. Mass.:26039.60
Organism:Homo sapiens (Human)
Description:n/a
Residue:233
BDBM50195311
NameBDBM50195311
Synonyms:CHEMBL3960206
TypeSmall organic molecule
Emp. Form.C30H25ClN4O6S2
Mol. Mass.637.126
SMILES[O-][N+](=O)c1cc(ccc1NCCSc1ccccc1)S(=O)(=O)NC(=O)c1ccc(NC(=O)\C=C\c2ccc(Cl)cc2)cc1