Reaction Details
TargetApoptosis regulator Bcl-2
LigandBDBM50195320
Substrate/Competitorn/a
Meas. Tech.ChEMBL_1617650 (CHEMBL3859719)
Ki 720±n/a nM
Citation Wang, MTian, WWang, CLu, SYang, CWang, JSong, YZhou, YZhu, JLi, ZZheng, C Design, synthesis, and activity evaluation of selective inhibitors of anti-apoptotic Bcl-2 proteins: The effects on the selectivity of the P1 pockets in the active sites. Bioorg Med Chem Lett26:5207-5211 (2016) 
 
Apoptosis regulator Bcl-2
Name:Apoptosis regulator Bcl-2
Type:Homodimer or heterodimer
Mol. Mass.:26269.11
Organism:Homo sapiens (Human)
Description:P10415
Residue:239
BDBM50195320
NameBDBM50195320
Synonyms:CHEMBL3980363
TypeSmall organic molecule
Emp. Form.C31H28N4O7S2
Mol. Mass.632.707
SMILESCOc1ccccc1\C=C\C(=O)Nc1ccc(cc1)C(=O)NS(=O)(=O)c1ccc(NCCSc2ccccc2)c(c1)[N+]([O-])=O