Reaction Details
TargetHistone-lysine N-methyltransferase EHMT2
LigandBDBM225263
Substrate/Competitorn/a
Meas. Tech.ChEMBL_1617770 (CHEMBL3859839)
EC50 5000±n/a nM
Citation Chen, WLWang, ZHFeng, TTLi, DDWang, CHXu, XLZhang, XJYou, QDGuo, XK Discovery, design and synthesis of 6H-anthra[1,9-cd]isoxazol-6-one scaffold as G9a inhibitor through a combination of shape-based virtual screening and structure-based molecular modification. Bioorg Med Chem24:6102-6108 (2016) 
 
Histone-lysine N-methyltransferase EHMT2
Name:Histone-lysine N-methyltransferase EHMT2
Type:Enzyme
Mol. Mass.:132339.87
Organism:Homo sapiens (Human)
Description:Q96KQ7
Residue:1210
BDBM225263
NameBDBM225263
Synonyms:Brd4470
TypeSmall organic molecule
Emp. Form.C25H23N3O3
Mol. Mass.413.4684
SMILESCOC(=O)c1ccc2n(CCCc3ccccc3)c(NC(=O)c3ccccc3)nc2c1