Reaction Details
TargetHistone-lysine N-methyltransferase EHMT2
LigandBDBM50300028
Substrate/Competitorn/a
Meas. Tech.ChEMBL_1617769 (CHEMBL3859838)
IC50 1900±n/a nM
Citation Chen, WLWang, ZHFeng, TTLi, DDWang, CHXu, XLZhang, XJYou, QDGuo, XK Discovery, design and synthesis of 6H-anthra[1,9-cd]isoxazol-6-one scaffold as G9a inhibitor through a combination of shape-based virtual screening and structure-based molecular modification. Bioorg Med Chem24:6102-6108 (2016) 
 
Histone-lysine N-methyltransferase EHMT2
Name:Histone-lysine N-methyltransferase EHMT2
Type:Enzyme
Mol. Mass.:132339.87
Organism:Homo sapiens (Human)
Description:Q96KQ7
Residue:1210
BDBM50300028
NameBDBM50300028
Synonyms:CHEMBL569864 | N-(1-benzylpiperidin-4-yl)-6,7-dimethoxy-2-(4-methyl-1,4-diazepan-1-yl)quinazolin-4-amine
TypeSmall organic molecule
Emp. Form.C28H38N6O2
Mol. Mass.490.6403
SMILESCOc1cc2nc(nc(NC3CCN(Cc4ccccc4)CC3)c2cc1OC)N1CCCN(C)CC1